Target
Solute carrier family 2, facilitated glucose transporter member 3
Ligand
BDBM50155670
Substrate
Meas. Tech.
ChEMBL_1565338 (CHEMBL3782732)
IC50
50±n/a nM
Citation
 Siebeneicher, HBauser, MBuchmann, BHeisler, IMüller, TNeuhaus, RRehwinkel, HTelser, JZorn, L Identification of novel GLUT inhibitors. Bioorg Med Chem Lett 26:1732-7 (2016)  
Target
Name:
Solute carrier family 2, facilitated glucose transporter member 3
Synonyms:
GLUT-3 GTR3_HUMAN SLC2A3 | Solute carrier family 2, facilitated glucose transporter member 3
Type:
PROTEIN
Mol. Mass.:
53925.15
Organism:
Homo sapiens (Human)
Description:
ChEMBL_101113
Residue:
496
  
Inhibitor
Name:
BDBM50155670
Synonyms:
CHEMBL3780144
Type:
Small organic molecule
Emp. Form.:
C23H21N7O
Mol. Mass.:
411.4591
SMILES:
COc1ccc(cc1N1CCN(CC1)c1ncnc2n(ncc12)-c1ccccc1)C#N
: