Target
Cyclin-C
Ligand
BDBM50154948
Substrate
Meas. Tech.
ChEMBL_1562017 (CHEMBL3779191)
IC50
270±n/a nM
Citation
 Schiemann, KMallinger, AWienke, DEsdar, CPoeschke, OBusch, MRohdich, FEccles, SASchneider, RRaynaud, FICzodrowski, PMusil, DSchwarz, DUrbahns, KBlagg, J Discovery of potent and selective CDK8 inhibitors from an HSP90 pharmacophore. Bioorg Med Chem Lett 26:1443-51 (2016)  
Target
Name:
Cyclin-C
Synonyms:
CCNC Cyclin C hSRB11
Type:
PROTEIN
Mol. Mass.:
33244.88
Organism:
Homo sapiens (Human)
Description:
ChEMBL_107900
Residue:
283
  
Inhibitor
Name:
BDBM50154948
Synonyms:
CHEMBL3775895
Type:
Small organic molecule
Emp. Form.:
C23H20N6
Mol. Mass.:
380.4451
SMILES:
Cn1cc(cn1)-c1ccc(Cc2n[nH]c3ccc(cc23)-c2cc(N)ccn2)cc1
: