Target
NACHT, LRR and PYD domains-containing protein 3
Ligand
BDBM50155930
Substrate
Meas. Tech.
ChEMBL_1564790 (CHEMBL3784393)
IC50
5000±n/a nM
Citation
 Baldwin, AGBrough, DFreeman, S Inhibiting the Inflammasome: A Chemical Perspective. J Med Chem 59:1691-710 (2016)  
Target
Name:
NACHT, LRR and PYD domains-containing protein 3
Synonyms:
Cias1 Cold autoinflammatory syndrome 1 protein homolog Mast cell maturation-associated-inducible protein 1 NACHT, LRR and PYD domains-containing protein 3 Nalp3 PYRIN-containing APAF1-like protein 1 | Pypaf1
Type:
PROTEIN
Mol. Mass.:
118281.75
Organism:
Mus musculus
Description:
ChEMBL_116758
Residue:
1033
  
Inhibitor
Name:
BDBM50155930
Synonyms:
CHEMBL3138690
Type:
Small organic molecule
Emp. Form.:
C26H30O5
Mol. Mass.:
422.5134
SMILES:
[H][C@]12O[C@@]11[C@@](C)(CC[C@]3([H])[C@@]4(C)C=CC(=O)C(C)(C)[C@]4([H])C=C[C@@]13C)[C@@H](OC2=O)c1ccoc1
: