Target
Chromobox protein homolog 8
Ligand
BDBM50155931
Substrate
Meas. Tech.
ChEBML_1565747
Kd
1000±n/a nM
Citation
 Milosevich, NGignac, MCMcFarlane, JSimhadri, CHorvath, SDaze, KDCroft, CSDheri, AQuon, TTDouglas, SFWulff, JEPaci, IHof, F Selective Inhibition of CBX6: A Methyllysine Reader Protein in the Polycomb Family. ACS Med Chem Lett 7:139-44 (2016)  
Target
Name:
Chromobox protein homolog 8
Synonyms:
CBX8 PC3 RC1 hPc3
Type:
PROTEIN
Mol. Mass.:
43415.86
Organism:
Homo sapiens (Human)
Description:
ChEMBL_108272
Residue:
389
  
Inhibitor
Name:
BDBM50155931
Synonyms:
CHEMBL3780251
Type:
Small organic molecule
Emp. Form.:
C72H83BrN11O17S
Mol. Mass.:
1486.461
SMILES:
C[C@H](NC(=O)[C@H](Cc1ccccc1)NC(=O)c1ccc(Br)cc1)C(=O)N[C@@H](Cc1ccc(O)cc1)C(=O)N[C@@H](CCCC[N+](C)(C)C)C(=O)N[C@@H](CO)C(=O)N[C@@H](CCC(O)=O)C(=O)N[C@@H](CCCCNC(=S)Nc1ccc(c(c1)C(O)=O)-c1c2ccc(O)cc2oc2cc(=O)ccc12)C(N)=O
: