Target
Tyrosine-protein kinase Lck
Ligand
BDBM50157880
Substrate
Meas. Tech.
ChEMBL_1570043 (CHEMBL3789406)
IC50
690±n/a nM
Citation
 Stauffer, FCowan-Jacob, SWScheufler, CFuret, P Identification of a 5-[3-phenyl-(2-cyclic-ether)-methylether]-4-aminopyrrolo[2,3-d]pyrimidine series of IGF-1R inhibitors. Bioorg Med Chem Lett 26:2065-7 (2016)  
Target
Name:
Tyrosine-protein kinase Lck
Synonyms:
2.7.10.2 LCK_HUMAN Leukocyte C-terminal Src kinase Lymphocyte-specific protein tyrosine kinase Protein YT16 Proto-oncogene tyrosine-protein kinase LCK T cell-specific protein-tyrosine kinase
Type:
Mol. Mass.:
57987.83
Organism:
Homo sapiens (Human)
Description:
P06239
Residue:
509
  
Inhibitor
Name:
BDBM50157880
Synonyms:
CHEMBL3787112
Type:
Small organic molecule
Emp. Form.:
C20H23N5O
Mol. Mass.:
349.4295
SMILES:
Nc1ncnc2n(cc(-c3cccc(O)c3)c12)[C@@H]1C[C@H](CN2CCC2)C1
: