Target
Bromodomain-containing protein 4
Ligand
BDBM50159132
Substrate
Meas. Tech.
ChEMBL_1566566 (CHEMBL3791460)
Kd
7400±n/a nM
Citation
 Hügle, MLucas, XWeitzel, GOstrovskyi, DBreit, BGerhardt, SEinsle, OGünther, SWohlwend, D 4-Acyl Pyrrole Derivatives Yield Novel Vectors for Designing Inhibitors of the Acetyl-Lysine Recognition Site of BRD4(1). J Med Chem 59:1518-30 (2016)  
Target
Name:
Bromodomain-containing protein 4
Synonyms:
BRD4 Bromodomain-containing protein 4 (BRD4) Protein HUNK1
Type:
Protein
Mol. Mass.:
152264.84
Organism:
Homo sapiens (Human)
Description:
O60885
Residue:
1362
  
Inhibitor
Name:
BDBM50159132
Synonyms:
CHEMBL3785971
Type:
Small organic molecule
Emp. Form.:
C19H23N3O4S
Mol. Mass.:
389.469
SMILES:
CCc1c([nH]c(C)c1C(C)=O)C(=O)N1CCc2ccc(cc12)S(=O)(=O)NC
: