Target
Bromodomain-containing protein 4
Ligand
BDBM50159134
Substrate
Meas. Tech.
ChEMBL_1566566 (CHEMBL3791460)
Kd
880±n/a nM
Citation
 Hügle, MLucas, XWeitzel, GOstrovskyi, DBreit, BGerhardt, SEinsle, OGünther, SWohlwend, D 4-Acyl Pyrrole Derivatives Yield Novel Vectors for Designing Inhibitors of the Acetyl-Lysine Recognition Site of BRD4(1). J Med Chem 59:1518-30 (2016)  
Target
Name:
Bromodomain-containing protein 4
Synonyms:
BRD4 Bromodomain-containing protein 4 (BRD4) Protein HUNK1
Type:
Protein
Mol. Mass.:
152264.84
Organism:
Homo sapiens (Human)
Description:
O60885
Residue:
1362
  
Inhibitor
Name:
BDBM50159134
Synonyms:
CHEMBL3786700
Type:
Small organic molecule
Emp. Form.:
C21H29N3O5S
Mol. Mass.:
435.537
SMILES:
CCN(CC)S(=O)(=O)c1cc(NC(=O)c2[nH]c(C)c(C(C)=O)c2CC)c(O)cc1C
: