Target
Bromodomain-containing protein 3
Ligand
BDBM50159133
Substrate
Meas. Tech.
ChEMBL_1566568 (CHEMBL3791462)
Kd
6100±n/a nM
Citation
 Hügle, MLucas, XWeitzel, GOstrovskyi, DBreit, BGerhardt, SEinsle, OGünther, SWohlwend, D 4-Acyl Pyrrole Derivatives Yield Novel Vectors for Designing Inhibitors of the Acetyl-Lysine Recognition Site of BRD4(1). J Med Chem 59:1518-30 (2016)  
Target
Name:
Bromodomain-containing protein 3
Synonyms:
BRD3 Bromodomain and extra-terminal motif (BET) Bromodomain-containing protein 3 (BRD3) RING3-like protein | RING3L
Type:
Protein
Mol. Mass.:
79571.81
Organism:
Homo sapiens (Human)
Description:
Q15059
Residue:
726
  
Inhibitor
Name:
BDBM50159133
Synonyms:
CHEMBL3786180
Type:
Small organic molecule
Emp. Form.:
C20H24FN3O5S
Mol. Mass.:
437.485
SMILES:
CCc1c([nH]c(C)c1C(C)=O)C(=O)Nc1ccc(F)c(c1)S(=O)(=O)N1CCOCC1
: