Target
Bromodomain-containing protein 3
Ligand
BDBM50159138
Substrate
Meas. Tech.
ChEMBL_1566568 (CHEMBL3791462)
Kd
50000±n/a nM
Citation
 Hügle, MLucas, XWeitzel, GOstrovskyi, DBreit, BGerhardt, SEinsle, OGünther, SWohlwend, D 4-Acyl Pyrrole Derivatives Yield Novel Vectors for Designing Inhibitors of the Acetyl-Lysine Recognition Site of BRD4(1). J Med Chem 59:1518-30 (2016)  
Target
Name:
Bromodomain-containing protein 3
Synonyms:
BRD3 Bromodomain and extra-terminal motif (BET) Bromodomain-containing protein 3 (BRD3) RING3-like protein | RING3L
Type:
Protein
Mol. Mass.:
79571.81
Organism:
Homo sapiens (Human)
Description:
Q15059
Residue:
726
  
Inhibitor
Name:
BDBM50159138
Synonyms:
CHEMBL3785707
Type:
Small organic molecule
Emp. Form.:
C19H23N3O3
Mol. Mass.:
341.4042
SMILES:
CCc1c([nH]c(C)c1C(C)=O)C(=O)N(C)Cc1cccc(c1)C(N)=O
: