Target
Tyrosyl-DNA phosphodiesterase 2
Ligand
BDBM50161969
Substrate
Meas. Tech.
ChEBML_1572461
IC50
>111000±n/a nM
Citation
 Kankanala, JMarchand, CAbdelmalak, MAihara, HPommier, YWang, Z Isoquinoline-1,3-diones as Selective Inhibitors of Tyrosyl DNA Phosphodiesterase II (TDP2). J Med Chem 59:2734-46 (2016)  
Target
Name:
Tyrosyl-DNA phosphodiesterase 2
Synonyms:
EAP2 ETS1-associated protein 2 TDP2 TTRAP Tyr-DNA phosphodiesterase 2 Tyrosyl-DNA phosphodiesterase 2 (hTDP2) VPg unlinkase | hTDP2
Type:
Enzyme Catalytic Domain
Mol. Mass.:
40916.54
Organism:
Homo sapiens (Human)
Description:
gi_23510348
Residue:
362
  
Inhibitor
Name:
BDBM50161969
Synonyms:
CHEMBL3792579
Type:
Small organic molecule
Emp. Form.:
C16H13NO2
Mol. Mass.:
251.2799
SMILES:
O=C1Cc2cc(Cc3ccccc3)ccc2C(=O)N1
: