Target
Glutamate receptor 2
Ligand
BDBM50164398
Substrate
Meas. Tech.
ChEMBL_1574106 (CHEMBL3801516)
EC50
9100±n/a nM
Citation
 Volgraf, MSellers, BDJiang, YWu, GLy, CQVillemure, EPastor, RMYuen, PWLu, ALuo, XLiu, MZhang, SSun, LFu, YLupardus, PJWallweber, HJLiederer, BMDeshmukh, GPlise, ETay, SReynen, PHerrington, JGustafson, ALiu, YDirksen, ADietz, MGLiu, YWang, TMHanson, JEHackos, DScearce-Levie, KSchwarz, JB Discovery of GluN2A-Selective NMDA Receptor Positive Allosteric Modulators (PAMs): Tuning Deactivation Kinetics via Structure-Based Design. J Med Chem 59:2760-79 (2016)  
Target
Name:
Glutamate receptor 2
Synonyms:
AMPA-selective glutamate receptor 2 GRIA2 GluR-2 GluR-K2 Glutamate receptor 2 Glutamate receptor AMPA 2/3 Glutamate receptor ionotropic, AMPA 2
Type:
Enzyme Catalytic Domain
Mol. Mass.:
98825.96
Organism:
Homo sapiens (Human)
Description:
Glutamate AMPA 2 GRIA2 HUMAN::P42262
Residue:
883
  
Inhibitor
Name:
BDBM50164398
Synonyms:
CHEMBL3799213
Type:
Small organic molecule
Emp. Form.:
C16H8ClF6N5OS
Mol. Mass.:
467.776
SMILES:
FC(F)(F)c1cc(Cl)n(Cc2cc(=O)n3c([C@@H]4C[C@H]4C#N)c(sc3n2)C(F)(F)F)n1
: