Target
Glutamate receptor 2
Ligand
BDBM50164400
Substrate
Meas. Tech.
ChEMBL_1574110 (CHEMBL3801520)
EC50
73200±n/a nM
Citation
 Volgraf, MSellers, BDJiang, YWu, GLy, CQVillemure, EPastor, RMYuen, PWLu, ALuo, XLiu, MZhang, SSun, LFu, YLupardus, PJWallweber, HJLiederer, BMDeshmukh, GPlise, ETay, SReynen, PHerrington, JGustafson, ALiu, YDirksen, ADietz, MGLiu, YWang, TMHanson, JEHackos, DScearce-Levie, KSchwarz, JB Discovery of GluN2A-Selective NMDA Receptor Positive Allosteric Modulators (PAMs): Tuning Deactivation Kinetics via Structure-Based Design. J Med Chem 59:2760-79 (2016)  
Target
Name:
Glutamate receptor 2
Synonyms:
AMPA-selective glutamate receptor 2 GRIA2 GluR-2 GluR-K2 Glutamate receptor 2 Glutamate receptor AMPA 2/3 Glutamate receptor ionotropic, AMPA 2
Type:
Enzyme Catalytic Domain
Mol. Mass.:
98825.96
Organism:
Homo sapiens (Human)
Description:
Glutamate AMPA 2 GRIA2 HUMAN::P42262
Residue:
883
  
Inhibitor
Name:
BDBM50164400
Synonyms:
CHEMBL3799694
Type:
Small organic molecule
Emp. Form.:
C15H13ClF3N5O2S
Mol. Mass.:
419.809
SMILES:
CCNC(=O)c1c(C)sc2nc(Cn3nc(cc3Cl)C(F)(F)F)cc(=O)n12
: