Target
WD repeat-containing protein 5
Ligand
BDBM50164796
Substrate
Meas. Tech.
ChEMBL_1575810 (CHEMBL3801642)
Kd
50±n/a nM
Citation
 Getlik, MSmil, DZepeda-Velázquez, CBolshan, YPoda, GWu, HDong, AKuznetsova, EMarcellus, RSenisterra, GDombrovski, LHajian, TKiyota, TSchapira, MArrowsmith, CHBrown, PJVedadi, MAl-Awar, R Structure-Based Optimization of a Small Molecule Antagonist of the Interaction Between WD Repeat-Containing Protein 5 (WDR5) and Mixed-Lineage Leukemia 1 (MLL1). J Med Chem 59:2478-96 (2016)  
Target
Name:
WD repeat-containing protein 5
Synonyms:
BIG3 WD repeat-containing protein 5 (WDR5) WDR5 | WDR5_HUMAN
Type:
Protein
Mol. Mass.:
36597.13
Organism:
Homo sapiens (Human)
Description:
P61964
Residue:
334
  
Inhibitor
Name:
BDBM50164796
Synonyms:
CHEMBL3800054
Type:
Small organic molecule
Emp. Form.:
C23H23F3N6O2
Mol. Mass.:
472.4629
SMILES:
CN1CCN(CC1)c1ccc(cc1NC(=O)c1c[nH]c(=O)cc1C(F)(F)F)-c1ccc(N)nc1
: