Target
Serine/threonine-protein kinase B-raf
Ligand
BDBM50165870
Substrate
Meas. Tech.
ChEMBL_1574500 (CHEMBL3804126)
IC50
1.000000±n/a nM
Citation
 Liu, LLee, MRKim, JLWhittington, DABregman, HHua, ZLewis, RTMartin, MWNishimura, NPotashman, MYang, KYi, SVaida, KREpstein, LFBabij, CFernando, MCarnahan, JNorman, MH Purinylpyridinylamino-based DFG-in/aC-helix-out B-Raf inhibitors: Applying mutant versus wild-type B-Raf selectivity indices for compound profiling. Bioorg Med Chem 24:2215-34 (2016)  
Target
Name:
Serine/threonine-protein kinase B-raf
Synonyms:
B-RAF B-Raf proto-oncogene serine/threonine-protein kinase BRAF1 RAFB1 v-Raf murine sarcoma viral oncogene homolog B1
Type:
Serine/threonine-protein kinase
Mol. Mass.:
84446.00
Organism:
Homo sapiens (Human)
Description:
P15056
Residue:
766
  
Inhibitor
Name:
BDBM50165870
Synonyms:
CHEMBL3797403
Type:
Small organic molecule
Emp. Form.:
C19H13F2N9O2S
Mol. Mass.:
469.427
SMILES:
Fc1ccc(NS(=O)(=O)c2cn[nH]c2)c(F)c1Nc1ncccc1-c1ncnc2[nH]cnc12
: