Target
Serine/threonine-protein kinase B-raf
Ligand
BDBM197706
Substrate
Meas. Tech.
ChEMBL_1574503 (CHEMBL3804129)
IC50
28±n/a nM
Citation
 Liu, LLee, MRKim, JLWhittington, DABregman, HHua, ZLewis, RTMartin, MWNishimura, NPotashman, MYang, KYi, SVaida, KREpstein, LFBabij, CFernando, MCarnahan, JNorman, MH Purinylpyridinylamino-based DFG-in/aC-helix-out B-Raf inhibitors: Applying mutant versus wild-type B-Raf selectivity indices for compound profiling. Bioorg Med Chem 24:2215-34 (2016)  
Target
Name:
Serine/threonine-protein kinase B-raf
Synonyms:
B-RAF B-Raf proto-oncogene serine/threonine-protein kinase BRAF1 RAFB1 v-Raf murine sarcoma viral oncogene homolog B1
Type:
Serine/threonine-protein kinase
Mol. Mass.:
84446.00
Organism:
Homo sapiens (Human)
Description:
P15056
Residue:
766
  
Inhibitor
Name:
BDBM197706
Synonyms:
US9216981, 35 | US9550781, 15
Type:
Small organic molecule
Emp. Form.:
C22H15F2N7O2S
Mol. Mass.:
479.462
SMILES:
Fc1ccc(NS(=O)(=O)c2ccccc2)c(F)c1Nc1ncccc1-c1ncnc2[nH]cnc12
: