Target
Kinesin-1 heavy chain/Proto-oncogene tyrosine-protein kinase receptor Ret
Ligand
BDBM50165897
Substrate
Meas. Tech.
ChEMBL_1575092 (CHEMBL3804159)
IC50
600±n/a nM
Citation
 Jordan, AMBegum, HFairweather, EFritzl, SGoldberg, KHopkins, GVHamilton, NMLyons, AJMarch, HNNewton, RSmall, HFVishwanath, SWaddell, IDWaszkowycz, BWatson, AJOgilvie, DJ Anilinoquinazoline inhibitors of the RET kinase domain-Elaboration of the 7-position. Bioorg Med Chem Lett 26:2724-9 (2016)  
Target
Name:
Kinesin-1 heavy chain/Proto-oncogene tyrosine-protein kinase receptor Ret
Synonyms:
Kinesin-1 heavy chain/ Tyrosine-protein kinase receptor RET
Type:
Mol. Mass.:
Description:
ASSAY_ID of ChEMBL is 1972971
Components:
This complex has 2 components.
Component 1
Name:
Proto-oncogene tyrosine-protein kinase receptor Ret
Synonyms:
CDHF12 Cadherin family member 12 Proto-oncogene c-Ret RET51 Tyrosine-protein kinase Ret (RET)
Type:
Protein
Mol. Mass.:
124318.29
Organism:
Homo sapiens (Human)
Description:
P07949
Residue:
1114
  
Component 2
Name:
Kinesin-1 heavy chain
Synonyms:
KIF5B KNS | KNS1
Type:
PROTEIN
Mol. Mass.:
109682.61
Organism:
Homo sapiens (Human)
Description:
ChEMBL_770435
Residue:
963
  
Inhibitor
Name:
BDBM50165897
Synonyms:
CHEMBL3798883
Type:
Small organic molecule
Emp. Form.:
C24H26F4N4O3
Mol. Mass.:
494.4819
SMILES:
COc1cc2c(Nc3c(F)ccc(O)c3C)ncnc2cc1OCCCN1CCCC1C(F)(F)F
: