Target
Vascular endothelial growth factor receptor 2
Ligand
BDBM50165897
Substrate
Meas. Tech.
ChEMBL_1575093 (CHEMBL3804160)
IC50
>10000±n/a nM
Citation
 Jordan, AMBegum, HFairweather, EFritzl, SGoldberg, KHopkins, GVHamilton, NMLyons, AJMarch, HNNewton, RSmall, HFVishwanath, SWaddell, IDWaszkowycz, BWatson, AJOgilvie, DJ Anilinoquinazoline inhibitors of the RET kinase domain-Elaboration of the 7-position. Bioorg Med Chem Lett 26:2724-9 (2016)  
Target
Name:
Vascular endothelial growth factor receptor 2
Synonyms:
CD_antigen=CD309 Fetal liver kinase 1 (FLK-1) KDR Protein-tyrosine kinase receptor Flk-1 VEGFR-2 VEGFR2 Vascular Endothelial Growth Factor Receptor Kinase 2 Vascular endothelial growth factor receptor 2 (KDR) Vascular endothelial growth factor receptor 2 (VEGFR2) Vascular endothelial growth factor receptor-2 (VEGFR-2)
Type:
Receptor Tyrosine Kinase
Mol. Mass.:
151510.97
Organism:
Homo sapiens (Human)
Description:
P35968
Residue:
1356
  
Inhibitor
Name:
BDBM50165897
Synonyms:
CHEMBL3798883
Type:
Small organic molecule
Emp. Form.:
C24H26F4N4O3
Mol. Mass.:
494.4819
SMILES:
COc1cc2c(Nc3c(F)ccc(O)c3C)ncnc2cc1OCCCN1CCCC1C(F)(F)F
: