Target
Proto-oncogene tyrosine-protein kinase receptor Ret
Ligand
BDBM50165897
Substrate
Meas. Tech.
ChEMBL_1575090 (CHEMBL3804157)
IC50
62±n/a nM
Citation
 Jordan, AMBegum, HFairweather, EFritzl, SGoldberg, KHopkins, GVHamilton, NMLyons, AJMarch, HNNewton, RSmall, HFVishwanath, SWaddell, IDWaszkowycz, BWatson, AJOgilvie, DJ Anilinoquinazoline inhibitors of the RET kinase domain-Elaboration of the 7-position. Bioorg Med Chem Lett 26:2724-9 (2016)  
Target
Name:
Proto-oncogene tyrosine-protein kinase receptor Ret
Synonyms:
CDHF12 Cadherin family member 12 Proto-oncogene c-Ret RET51 Tyrosine-protein kinase Ret (RET)
Type:
Protein
Mol. Mass.:
124318.29
Organism:
Homo sapiens (Human)
Description:
P07949
Residue:
1114
  
Inhibitor
Name:
BDBM50165897
Synonyms:
CHEMBL3798883
Type:
Small organic molecule
Emp. Form.:
C24H26F4N4O3
Mol. Mass.:
494.4819
SMILES:
COc1cc2c(Nc3c(F)ccc(O)c3C)ncnc2cc1OCCCN1CCCC1C(F)(F)F
: