Target
Microtubule-associated protein 2
Ligand
BDBM50167278
Substrate
Meas. Tech.
ChEMBL_1573781 (CHEMBL3803202)
EC50
32±n/a nM
Citation
 McBride, CCheruvallath, ZKomandla, MTang, MFarrell, PLawson, JDVanderpool, DWu, YDougan, DRPlonowski, AHolub, CLarson, C Discovery of potent, reversible MetAP2 inhibitors via fragment based drug discovery and structure based drug design-Part 2. Bioorg Med Chem Lett 26:2779-2783 (2016)  
Target
Name:
Microtubule-associated protein 2
Synonyms:
MAP-2 MTAP2_HUMAN
Type:
PROTEIN
Mol. Mass.:
199423.64
Organism:
Homo sapiens (Human)
Description:
ChEMBL_107603
Residue:
1827
  
Inhibitor
Name:
BDBM50167278
Synonyms:
CHEMBL3800236
Type:
Small organic molecule
Emp. Form.:
C14H9ClFN5
Mol. Mass.:
301.706
SMILES:
Nc1ncc(cc1Cl)-n1c2cn[nH]c2c2cc(F)ccc12
: