Target
Mucosa-associated lymphoid tissue lymphoma translocation protein 1
Ligand
BDBM50169050
Substrate
Meas. Tech.
ChEMBL_1577623 (CHEMBL3807231)
IC50
0.052000±n/a nM
Citation
 Abdel-Magid, AF MALT1 Inhibitors May Potentially Treat Lymphomas and Autoimmune Disorders. ACS Med Chem Lett 7:205-6 (2016)  
Target
Name:
Mucosa-associated lymphoid tissue lymphoma translocation protein 1
Synonyms:
MALT lymphoma-associated translocation MALT1 MLT Paracaspase
Type:
Enzyme
Mol. Mass.:
92257.81
Organism:
Homo sapiens (Human)
Description:
Q9UDY8
Residue:
824
  
Inhibitor
Name:
BDBM50169050
Synonyms:
CHEMBL3806279
Type:
Small organic molecule
Emp. Form.:
C17H17F3N6O2
Mol. Mass.:
394.3511
SMILES:
CO[C@@H](C)c1c(NC(=O)Nc2cncc(c2)C(F)(F)F)cnc2cc(C)nn12
: