Target
Metabotropic glutamate receptor 2
Ligand
BDBM50169622
Substrate
Meas. Tech.
ChEMBL_1576632 (CHEMBL3807550)
EC50
2200±n/a nM
Citation
 Pero, JERossi, MAKelly, MJLehman, HDLayton, MEGarbaccio, RMO'Brien, JAMagliaro, BCUslaner, JMHuszar, SLFillgrove, KLTang, CKuo, YJoyce, LASherer, ECJacobson, MA Optimization of Novel Aza-benzimidazolone mGluR2 PAMs with Respect to LLE and PK Properties and Mitigation of CYP TDI. ACS Med Chem Lett 7:312-7 (2016)  
Target
Name:
Metabotropic glutamate receptor 2
Synonyms:
GPRC1B GRM2_HUMAN Metabotropic glutamate receptor mGlu2 | metabotropic glutamate 2
Type:
Enzyme
Mol. Mass.:
95584.88
Organism:
Homo sapiens (Human)
Description:
Q14416
Residue:
872
  
Inhibitor
Name:
BDBM50169622
Synonyms:
CHEMBL3805883
Type:
Small organic molecule
Emp. Form.:
C21H32N4O
Mol. Mass.:
356.505
SMILES:
Cn1c2nc(ccc2n(CC(C)(C)C)c1=O)N1CCCC2CCCCC12
: