Target
Metabotropic glutamate receptor 3
Ligand
BDBM50169622
Substrate
Meas. Tech.
ChEMBL_1576635 (CHEMBL3807553)
EC50
>30000±n/a nM
Citation
 Pero, JERossi, MAKelly, MJLehman, HDLayton, MEGarbaccio, RMO'Brien, JAMagliaro, BCUslaner, JMHuszar, SLFillgrove, KLTang, CKuo, YJoyce, LASherer, ECJacobson, MA Optimization of Novel Aza-benzimidazolone mGluR2 PAMs with Respect to LLE and PK Properties and Mitigation of CYP TDI. ACS Med Chem Lett 7:312-7 (2016)  
Target
Name:
Metabotropic glutamate receptor 3
Synonyms:
GPRC1C GRM3_HUMAN metabotropic glutamate 3 metabotropic glutamate 3/1c
Type:
Enzyme Catalytic Domain
Mol. Mass.:
98889.09
Organism:
Homo sapiens (Human)
Description:
metabotropic glutamate 1c 0 HUMAN::Q14832
Residue:
879
  
Inhibitor
Name:
BDBM50169622
Synonyms:
CHEMBL3805883
Type:
Small organic molecule
Emp. Form.:
C21H32N4O
Mol. Mass.:
356.505
SMILES:
Cn1c2nc(ccc2n(CC(C)(C)C)c1=O)N1CCCC2CCCCC12
: