Target
Metabotropic glutamate receptor 6
Ligand
BDBM50169622
Substrate
Meas. Tech.
ChEMBL_1576638 (CHEMBL3807556)
EC50
>30000±n/a nM
Citation
 Pero, JERossi, MAKelly, MJLehman, HDLayton, MEGarbaccio, RMO'Brien, JAMagliaro, BCUslaner, JMHuszar, SLFillgrove, KLTang, CKuo, YJoyce, LASherer, ECJacobson, MA Optimization of Novel Aza-benzimidazolone mGluR2 PAMs with Respect to LLE and PK Properties and Mitigation of CYP TDI. ACS Med Chem Lett 7:312-7 (2016)  
Target
Name:
Metabotropic glutamate receptor 6
Synonyms:
GPRC1F GRM6_HUMAN Metabotropic glutamate receptor 6 metabotropic glutamate 6
Type:
Enzyme Catalytic Domain
Mol. Mass.:
95479.26
Organism:
Homo sapiens (Human)
Description:
metabotropic glutamate 6 GRM6 HUMAN::O15303
Residue:
877
  
Inhibitor
Name:
BDBM50169622
Synonyms:
CHEMBL3805883
Type:
Small organic molecule
Emp. Form.:
C21H32N4O
Mol. Mass.:
356.505
SMILES:
Cn1c2nc(ccc2n(CC(C)(C)C)c1=O)N1CCCC2CCCCC12
: