Target
Aminopeptidase N
Ligand
BDBM50170892
Substrate
Meas. Tech.
ChEMBL_1577954 (CHEMBL3806578)
Ki
2800±n/a nM
Citation
 Weglarz-Tomczak, EBerlicki, LPawelczak, MNocek, BJoachimiak, AMucha, A A structural insight into the P1S1 binding mode of diaminoethylphosphonic and phosphinic acids, selective inhibitors of alanine aminopeptidases. Eur J Med Chem 117:187-96 (2016)  
Target
Name:
Aminopeptidase N
Synonyms:
AMPN_PIG AP-M Alanyl aminopeptidase Aminopeptidase N (APN) Microsomal aminopeptidase pAPN
Type:
Protein
Mol. Mass.:
108810.25
Organism:
Sus scrofa (Pig)
Description:
P15145
Residue:
963
  
Inhibitor
Name:
BDBM50170892
Synonyms:
CHEMBL3804861
Type:
Small organic molecule
Emp. Form.:
C10H17N2O3P
Mol. Mass.:
244.2273
SMILES:
CC(NCC(N)P(O)(O)=O)c1ccccc1
: