Target
Aminopeptidase N
Ligand
BDBM50170892
Substrate
Meas. Tech.
ChEMBL_1577953 (CHEMBL3806577)
Ki
391±n/a nM
Citation
 Weglarz-Tomczak, EBerlicki, LPawelczak, MNocek, BJoachimiak, AMucha, A A structural insight into the P1S1 binding mode of diaminoethylphosphonic and phosphinic acids, selective inhibitors of alanine aminopeptidases. Eur J Med Chem 117:187-96 (2016)  
Target
Name:
Aminopeptidase N
Synonyms:
AMPN_HUMAN APN Aminopeptidase CD_antigen=CD13 Myeloid plasma membrane glycoprotein CD13 gp150 | hAPN
Type:
PROTEIN
Mol. Mass.:
109522.63
Organism:
Homo sapiens (Human)
Description:
ChEMBL_1507526
Residue:
967
  
Inhibitor
Name:
BDBM50170892
Synonyms:
CHEMBL3804861
Type:
Small organic molecule
Emp. Form.:
C10H17N2O3P
Mol. Mass.:
244.2273
SMILES:
CC(NCC(N)P(O)(O)=O)c1ccccc1
: