Target
G protein-coupled receptor kinase 5
Ligand
BDBM50173317
Substrate
Meas. Tech.
ChEMBL_1581285 (CHEMBL3811362)
IC50
>100000±n/a nM
Citation
 Waldschmidt, HVHoman, KTCruz-Rodríguez, OCato, MCWaninger-Saroni, JLarimore, KMCannavo, ASong, JCheung, JYKirchhoff, PDKoch, WJTesmer, JJLarsen, SD Structure-Based Design, Synthesis, and Biological Evaluation of Highly Selective and Potent G Protein-Coupled Receptor Kinase 2 Inhibitors. J Med Chem 59:3793-807 (2016)  
Target
Name:
G protein-coupled receptor kinase 5
Synonyms:
G protein-coupled receptor kinase GRK5 GRK5 | GRK5_HUMAN
Type:
PROTEIN
Mol. Mass.:
67798.93
Organism:
Homo sapiens (Human)
Description:
ChEMBL_1280627
Residue:
590
  
Inhibitor
Name:
BDBM50173317
Synonyms:
CHEMBL3810349 | US10023564, Example 12
Type:
Small organic molecule
Emp. Form.:
C21H19FN6O3
Mol. Mass.:
422.4124
SMILES:
CNC(=O)c1cc(ccc1F)C1NC(=O)NC(C)=C1C(=O)Nc1ccc2[nH]ncc2c1
: