Target
Dual specificity protein kinase TTK
Ligand
BDBM50173332
Substrate
Meas. Tech.
ChEBML_1581301
IC50
46±n/a nM
Citation
 Innocenti, PWoodward, HLSolanki, SNaud, SWestwood, IMCronin, NHayes, ARoberts, JHenley, ATBaker, RFaisal, AMak, GWBox, GValenti, MDe Haven Brandon, AO'Fee, LSaville, HSchmitt, JMatijssen, BBurke, Rvan Montfort, RLRaynaud, FIEccles, SALinardopoulos, SBlagg, JHoelder, S Rapid Discovery of Pyrido[3,4-d]pyrimidine Inhibitors of Monopolar Spindle Kinase 1 (MPS1) Using a Structure-Based Hybridization Approach. J Med Chem 59:3671-88 (2016)  
Target
Name:
Dual specificity protein kinase TTK
Synonyms:
Dual specificity protein kinase (TTK) MPS1 Monopolar Spindle 1 (MPS1) Monopolar Spindle 1 Kinase (MPS1) TTK | TTK_HUMAN
Type:
Protein
Mol. Mass.:
97086.79
Organism:
Homo sapiens (Human)
Description:
P33981
Residue:
857
  
Inhibitor
Name:
BDBM50173332
Synonyms:
CHEMBL3810175
Type:
Small organic molecule
Emp. Form.:
C19H18N6O2
Mol. Mass.:
362.3852
SMILES:
COc1ccc(Nc2ncc3ccnc(-c4cnn(C)c4)c3n2)c(OC)c1
: