Target
Broad substrate specificity ATP-binding cassette transporter ABCG2
Ligand
BDBM50174323
Substrate
Meas. Tech.
ChEMBL_1579349 (CHEMBL3813115)
IC50
840±n/a nM
Citation
 Kraege, SStefan, KJuvale, KRoss, TWillmes, TWiese, M The combination of quinazoline and chalcone moieties leads to novel potent heterodimeric modulators of breast cancer resistance protein (BCRP/ABCG2). Eur J Med Chem 117:212-29 (2016)  
Target
Name:
Broad substrate specificity ATP-binding cassette transporter ABCG2
Synonyms:
ABCG2 ABCP ATP-binding cassette sub-family G member 2 ATP-binding cassette, sub-family G, member 2 BCRP1 CDw338 Mitoxantrone resistance-associated protein Urate exporter
Type:
Multi-pass membrane protein; monomer or homodimer; disulfide-linked
Mol. Mass.:
72329.48
Organism:
Homo sapiens (Human)
Description:
Q9UNQ0
Residue:
655
  
Inhibitor
Name:
BDBM50174323
Synonyms:
CHEMBL3809167
Type:
Small organic molecule
Emp. Form.:
C25H21N3O3
Mol. Mass.:
411.4525
SMILES:
COc1ccc(\C=C\C(=O)c2ccc(Nc3ncnc4ccccc34)cc2)cc1OC
: