Target
ATP-dependent translocase ABCB1
Ligand
BDBM50174337
Substrate
Meas. Tech.
ChEMBL_1579358 (CHEMBL3813124)
IC50
32100±n/a nM
Citation
 Kraege, SStefan, KJuvale, KRoss, TWillmes, TWiese, M The combination of quinazoline and chalcone moieties leads to novel potent heterodimeric modulators of breast cancer resistance protein (BCRP/ABCG2). Eur J Med Chem 117:212-29 (2016)  
Target
Name:
ATP-dependent translocase ABCB1
Synonyms:
ABCB1 MDR1_HUMAN Multidrug resistance protein 1 P-glycoprotein (P-gp) PGY1
Type:
Protein
Mol. Mass.:
141503.50
Organism:
Homo sapiens (Human)
Description:
P08183
Residue:
1280
  
Inhibitor
Name:
BDBM50174337
Synonyms:
CHEMBL3809206
Type:
Small organic molecule
Emp. Form.:
C30H23N3O2
Mol. Mass.:
457.5225
SMILES:
COc1cccc(\C=C\C(=O)c2ccc(Nc3nc(nc4ccccc34)-c3ccccc3)cc2)c1
: