Target
Broad substrate specificity ATP-binding cassette transporter ABCG2
Ligand
BDBM50174339
Substrate
Meas. Tech.
ChEMBL_1579349 (CHEMBL3813115)
IC50
1090±n/a nM
Citation
 Kraege, SStefan, KJuvale, KRoss, TWillmes, TWiese, M The combination of quinazoline and chalcone moieties leads to novel potent heterodimeric modulators of breast cancer resistance protein (BCRP/ABCG2). Eur J Med Chem 117:212-29 (2016)  
Target
Name:
Broad substrate specificity ATP-binding cassette transporter ABCG2
Synonyms:
ABCG2 ABCP ATP-binding cassette sub-family G member 2 ATP-binding cassette, sub-family G, member 2 BCRP1 CDw338 Mitoxantrone resistance-associated protein Urate exporter
Type:
Multi-pass membrane protein; monomer or homodimer; disulfide-linked
Mol. Mass.:
72329.48
Organism:
Homo sapiens (Human)
Description:
Q9UNQ0
Residue:
655
  
Inhibitor
Name:
BDBM50174339
Synonyms:
CHEMBL3810089
Type:
Small organic molecule
Emp. Form.:
C31H25N3O3
Mol. Mass.:
487.5485
SMILES:
COc1ccc(cc1OC)-c1nc(Nc2ccc(cc2)C(=O)\C=C\c2ccccc2)c2ccccc2n1
: