Target
M-phase inducer phosphatase 1
Ligand
BDBM50174563
Substrate
Meas. Tech.
ChEMBL_1580591 (CHEMBL3810599)
IC50
8300±n/a nM
Citation
 Huber-Villaume, SRevelant, GSibille, EPhilippot, SMorabito, ADunand, SChaimbault, PBagrel, DKirsch, GHesse, SSchohn, H 2-(Thienothiazolylimino)-1,3-thiazolidin-4-ones inhibit cell division cycle 25 A phosphatase. Bioorg Med Chem 24:2920-2928 (2016)  
Target
Name:
M-phase inducer phosphatase 1
Synonyms:
CDC25A Dual specificity phosphatase Cdc25A MPIP1_HUMAN | phosphatase Cdc25
Type:
Protein
Mol. Mass.:
59090.18
Organism:
Homo sapiens (Human)
Description:
P30304
Residue:
524
  
Inhibitor
Name:
BDBM50174563
Synonyms:
CHEMBL3808551
Type:
Small organic molecule
Emp. Form.:
C22H14ClN3OS3
Mol. Mass.:
468.014
SMILES:
Cc1ccc(\C=C2\S\C(NC2=O)=N/c2nc3cc(sc3s2)-c2ccc(Cl)cc2)cc1
: