Target
Rap guanine nucleotide exchange factor 4
Ligand
BDBM50175070
Substrate
Meas. Tech.
ChEMBL_1580630 (CHEMBL3810792)
IC50
1700±n/a nM
Citation
 Wild, CTZhu, YNa, YMei, FYnalvez, MAChen, HCheng, XZhou, J Functionalized N,N-Diphenylamines as Potent and Selective EPAC2 Inhibitors. ACS Med Chem Lett 7:460-4 (2016)  
Target
Name:
Rap guanine nucleotide exchange factor 4
Synonyms:
CGEF2 EPAC2 Exchange protein directly activated by cAMP 2 RPGF4_HUMAN cAMP-regulated guanine nucleotide exchange factor II
Type:
PROTEIN
Mol. Mass.:
115526.83
Organism:
Homo sapiens (Human)
Description:
ChEMBL_1504794
Residue:
1011
  
Inhibitor
Name:
BDBM50175070
Synonyms:
CHEMBL3809465
Type:
Small organic molecule
Emp. Form.:
C17H21N
Mol. Mass.:
239.3553
SMILES:
Cc1cc(C)cc(Nc2c(C)cc(C)cc2C)c1
: