Target
Rap guanine nucleotide exchange factor 4
Ligand
BDBM50175225
Substrate
Meas. Tech.
ChEMBL_1580631 (CHEMBL3810793)
IC50
1000±n/a nM
Citation
 Wild, CTZhu, YNa, YMei, FYnalvez, MAChen, HCheng, XZhou, J Functionalized N,N-Diphenylamines as Potent and Selective EPAC2 Inhibitors. ACS Med Chem Lett 7:460-4 (2016)  
Target
Name:
Rap guanine nucleotide exchange factor 4
Synonyms:
CGEF2 EPAC2 Exchange protein directly activated by cAMP 2 RPGF4_HUMAN cAMP-regulated guanine nucleotide exchange factor II
Type:
PROTEIN
Mol. Mass.:
115526.83
Organism:
Homo sapiens (Human)
Description:
ChEMBL_1504794
Residue:
1011
  
Inhibitor
Name:
BDBM50175225
Synonyms:
CHEMBL3808606
Type:
Small organic molecule
Emp. Form.:
C16H15ClF3N
Mol. Mass.:
313.745
SMILES:
Cc1cc(C)c(Nc2ccc(Cl)c(c2)C(F)(F)F)c(C)c1
: