Target
Putative P2Y purinoceptor 10
Ligand
BDBM50177118
Substrate
Meas. Tech.
ChEBML_1581711
EC50
468±n/a nM
Citation
 Jung, SInoue, ANakamura, SKishi, TUwamizu, ASayama, MIkubo, MOtani, YKano, KMakide, KAoki, JOhwada, T Conformational Constraint of the Glycerol Moiety of Lysophosphatidylserine Affords Compounds with Receptor Subtype Selectivity. J Med Chem 59:3750-76 (2016)  
Target
Name:
Putative P2Y purinoceptor 10
Synonyms:
P2Y10 P2ry10 | Putative P2Y purinoceptor 10
Type:
PROTEIN
Mol. Mass.:
37264.07
Organism:
Mus musculus
Description:
ChEMBL_109764
Residue:
328
  
Inhibitor
Name:
BDBM50177118
Synonyms:
CHEMBL3814763
Type:
Small organic molecule
Emp. Form.:
C29H48NO10P
Mol. Mass.:
601.6659
SMILES:
CCCCCCCCCCCOc1ccccc1CCC(=O)OC[C@H]1OCCC[C@H]1OP(O)(=O)OC[C@H](N)C(O)=O
: