Target
Segment polarity protein dishevelled homolog DVL-1
Ligand
BDBM50177677
Substrate
Meas. Tech.
ChEMBL_1583394 (CHEMBL3816126)
Kd
186±n/a nM
Citation
 Choi, JMa, SKim, HYYun, JHHeo, JNLee, WChoi, KYNo, KT Identification of small-molecule compounds targeting the dishevelled PDZ domain by virtual screening and binding studies. Bioorg Med Chem 24:3259-66 (2016)  
Target
Name:
Segment polarity protein dishevelled homolog DVL-1
Synonyms:
DSH homolog 1 DVL1_HUMAN | Dishevelled-1
Type:
PROTEIN
Mol. Mass.:
75195.46
Organism:
Homo sapiens (Human)
Description:
ChEMBL_468588
Residue:
695
  
Inhibitor
Name:
BDBM50177677
Synonyms:
CHEMBL3814692
Type:
Small organic molecule
Emp. Form.:
C19H15BrO5S
Mol. Mass.:
435.288
SMILES:
CCOc1cc(\C=C2/Sc3ccccc3C2=O)cc(Br)c1OCC(O)=O
: