Target
Potassium channel subfamily K member 2
Ligand
BDBM50180656
Substrate
Meas. Tech.
ChEMBL_1584395 (CHEMBL3819816)
EC50
36000±n/a nM
Citation
 Vivier, DBennis, KLesage, FDucki, S Perspectives on the Two-Pore Domain Potassium Channel TREK-1 (TWIK-Related K(+) Channel 1). A Novel Therapeutic Target? J Med Chem 59:5149-57 (2016)  
Target
Name:
Potassium channel subfamily K member 2
Synonyms:
KCNK2 Outward rectifying potassium channel protein TREK-1 TREK-1 K(+) channel subunit Twik-RElated Potassium (K+) channel 1 (TREK1) Two pore potassium channel TPKC1
Type:
Protein
Mol. Mass.:
47099.16
Organism:
Homo sapiens (Human)
Description:
O95069
Residue:
426
  
Inhibitor
Name:
BDBM50180656
Synonyms:
CHEMBL3818503
Type:
Small organic molecule
Emp. Form.:
C18H17Cl2N5
Mol. Mass.:
374.267
SMILES:
CC1(C)c2cc(Cl)ccc2N(CCc2nnn[nH]2)c2ccc(Cl)cc12
: