Target
Neuraminidase
Ligand
BDBM50182249
Substrate
Meas. Tech.
ChEMBL_1585717 (CHEMBL3821014)
IC50
1.000000±n/a nM
Citation
 Sriwilaijaroen, NMagesh, SImamura, AAndo, HIshida, HSakai, MIshitsubo, EHori, TMoriya, SIshikawa, TKuwata, KOdagiri, TTashiro, MHiramatsu, HTsukamoto, KMiyagi, TTokiwa, HKiso, MSuzuki, Y A Novel Potent and Highly Specific Inhibitor against Influenza Viral N1-N9 Neuraminidases: Insight into Neuraminidase-Inhibitor Interactions. J Med Chem 59:4563-77 (2016)  
Target
Name:
Neuraminidase
Synonyms:
NA | NRAM_I33A0
Type:
PROTEIN
Mol. Mass.:
49687.56
Organism:
Influenza A virus
Description:
ChEMBL_1347422
Residue:
453
  
Inhibitor
Name:
BDBM50182249
Synonyms:
CHEMBL3818159
Type:
Small organic molecule
Emp. Form.:
C15H29N2O8P
Mol. Mass.:
396.3731
SMILES:
OP(O)(O)=O.CCC(CC)OC[C@@H]1CC(=C[C@H](N)[C@H]1NC(C)=O)C(O)=O
: