Target
Peregrin
Ligand
BDBM50182408
Substrate
Meas. Tech.
ChEMBL_1584538 (CHEMBL3820393)
Kd
105000±n/a nM
Citation
 Zhu, JCaflisch, A Twenty Crystal Structures of Bromodomain and PHD Finger Containing Protein 1 (BRPF1)/Ligand Complexes Reveal Conserved Binding Motifs and Rare Interactions. J Med Chem 59:5555-61 (2016)  
Target
Name:
Peregrin
Synonyms:
BR140 BRPF1_HUMAN Peregrin | Protein Br140
Type:
PROTEIN
Mol. Mass.:
137524.47
Organism:
Homo sapiens (Human)
Description:
ChEMBL_108054
Residue:
1214
  
Inhibitor
Name:
BDBM50182408
Synonyms:
CHEMBL3818063
Type:
Small organic molecule
Emp. Form.:
C8H7BrN2O
Mol. Mass.:
227.058
SMILES:
Brc1ccc2NC(=O)CNc2c1
: