Target
Tyrosine-protein phosphatase non-receptor type 2
Ligand
BDBM13814
Substrate
Meas. Tech.
ChEMBL_1586222 (CHEMBL3819937)
IC50
87±n/a nM
Citation
 Li, XWang, LShi, D The design strategy of selective PTP1B inhibitors over TCPTP. Bioorg Med Chem 24:3343-52 (2016)  
Target
Name:
Tyrosine-protein phosphatase non-receptor type 2
Synonyms:
PTN2_HUMAN PTPT T-cell protein-tyrosine phosphatase TCPTP Tyrosine-protein phosphatase non-receptor type 2 (TC-PTP)
Type:
Protein
Mol. Mass.:
48481.80
Organism:
Homo sapiens (Human)
Description:
P17706
Residue:
415
  
Inhibitor
Name:
BDBM13814
Synonyms:
({4-[(4E)-2-(1H-1,2,3-benzotriazol-1-yl)-2-[4-(methoxycarbonyl)phenyl]-5-phenylpent-4-en-1-yl]phenyl}difluoromethyl)phosphonic acid | benzotriazole phenyldifluoromethylphosphonic acid compound 1
Type:
Small organic molecule
Emp. Form.:
C32H28F2N3O5P
Mol. Mass.:
603.5524
SMILES:
COC(=O)c1ccc(cc1)C(C\C=C\c1ccccc1)(Cc1ccc(cc1)C(F)(F)P(O)(O)=O)n1nnc2ccccc12
: