Target
Apelin receptor
Ligand
BDBM50183380
Substrate
Meas. Tech.
ChEMBL_1586261 (CHEMBL3820079)
EC50
3700±n/a nM
Citation
 Narayanan, SMaitra, RDeschamps, JRBortoff, KThomas, JBZhang, YWarner, KVasukuttan, VDecker, ARunyon, SP Discovery of a novel small molecule agonist scaffold for the APJ receptor. Bioorg Med Chem 24:3758-70 (2016)  
Target
Name:
Apelin receptor
Synonyms:
AGTRL1 APJ_HUMAN Angiotensin receptor-like 1 Apelin receptor (APJ) G-protein coupled receptor HG11
Type:
Enzyme Catalytic Domain
Mol. Mass.:
42664.06
Organism:
Homo sapiens (Human)
Description:
P35414
Residue:
380
  
Inhibitor
Name:
BDBM50183380
Synonyms:
CHEMBL3819625
Type:
Small organic molecule
Emp. Form.:
C19H21NO4S
Mol. Mass.:
359.439
SMILES:
CC1=CC(=O)C(=C\C1=N\OS(=O)(=O)c1ccccc1)C1CCCCC1
: