Target
Bifunctional epoxide hydrolase 2
Ligand
BDBM50184990
Substrate
Meas. Tech.
ChEMBL_1588271 (CHEMBL3825936)
IC50
7500±n/a nM
Citation
 Kitamura, SHvorecny, KLNiu, JHammock, BDMadden, DRMorisseau, C Rational Design of Potent and Selective Inhibitors of an Epoxide Hydrolase Virulence Factor from Pseudomonas aeruginosa. J Med Chem 59:4790-9 (2016)  
Target
Name:
Bifunctional epoxide hydrolase 2
Synonyms:
Cytosolic epoxide hydrolase 2 EPHX2 HYES_HUMAN Soluble epoxide hydrolase (sEH) | epoxide hydrolase 2, cytoplasmic
Type:
Enzyme
Mol. Mass.:
62613.07
Organism:
Homo sapiens (Human)
Description:
P34913
Residue:
555
  
Inhibitor
Name:
BDBM50184990
Synonyms:
CHEMBL3824249
Type:
Small organic molecule
Emp. Form.:
C22H19Cl2N3O4
Mol. Mass.:
460.31
SMILES:
CCC(=O)Nc1cc(Cl)c(Oc2ccc(O)c(c2)-c2ccc(NC(N)=O)cc2)c(Cl)c1
: