Target
Bifunctional epoxide hydrolase 2
Ligand
BDBM50184991
Substrate
Meas. Tech.
ChEMBL_1588271 (CHEMBL3825936)
IC50
7700±n/a nM
Citation
 Kitamura, SHvorecny, KLNiu, JHammock, BDMadden, DRMorisseau, C Rational Design of Potent and Selective Inhibitors of an Epoxide Hydrolase Virulence Factor from Pseudomonas aeruginosa. J Med Chem 59:4790-9 (2016)  
Target
Name:
Bifunctional epoxide hydrolase 2
Synonyms:
Cytosolic epoxide hydrolase 2 EPHX2 HYES_HUMAN Soluble epoxide hydrolase (sEH) | epoxide hydrolase 2, cytoplasmic
Type:
Enzyme
Mol. Mass.:
62613.07
Organism:
Homo sapiens (Human)
Description:
P34913
Residue:
555
  
Inhibitor
Name:
BDBM50184991
Synonyms:
CHEMBL3824048
Type:
Small organic molecule
Emp. Form.:
C23H19Cl2NO4
Mol. Mass.:
444.307
SMILES:
CCC(=O)Nc1cc(Cl)c(Oc2ccc(O)c(c2)-c2ccc(cc2)C(C)=O)c(Cl)c1
: