Target
Epoxide hydrolase 1
Ligand
BDBM50184991
Substrate
Meas. Tech.
ChEMBL_1588272 (CHEMBL3825937)
IC50
97800±n/a nM
Citation
 Kitamura, SHvorecny, KLNiu, JHammock, BDMadden, DRMorisseau, C Rational Design of Potent and Selective Inhibitors of an Epoxide Hydrolase Virulence Factor from Pseudomonas aeruginosa. J Med Chem 59:4790-9 (2016)  
Target
Name:
Epoxide hydrolase 1
Synonyms:
EPHX EPOX Epoxide hydrolase (HsEH) HYEP_HUMAN | Microsomal epoxide hydrolase
Type:
Protein
Mol. Mass.:
52954.28
Organism:
Homo sapiens (Human)
Description:
P07099
Residue:
455
  
Inhibitor
Name:
BDBM50184991
Synonyms:
CHEMBL3824048
Type:
Small organic molecule
Emp. Form.:
C23H19Cl2NO4
Mol. Mass.:
444.307
SMILES:
CCC(=O)Nc1cc(Cl)c(Oc2ccc(O)c(c2)-c2ccc(cc2)C(C)=O)c(Cl)c1
: