Target
Nuclear receptor subfamily 1 group I member 3
Ligand
BDBM50185307
Substrate
Meas. Tech.
ChEMBL_1587671 (CHEMBL3825785)
EC50
2070±n/a nM
Citation
 Smutny, TNova, ADrechslerová, MCarazo, AHyrsova, LHru?ková, ZRKune?, JPour, M?pulák, MPavek, P 2-(3-Methoxyphenyl)quinazoline Derivatives: A New Class of Direct Constitutive Androstane Receptor (CAR) Agonists. J Med Chem 59:4601-10 (2016)  
Target
Name:
Nuclear receptor subfamily 1 group I member 3
Synonyms:
CAR NR1I3_HUMAN
Type:
PROTEIN
Mol. Mass.:
39953.17
Organism:
Homo sapiens (Human)
Description:
ChEMBL_1434936
Residue:
352
  
Inhibitor
Name:
BDBM50185307
Synonyms:
CHEMBL3822473
Type:
Small organic molecule
Emp. Form.:
C16H14N2O2
Mol. Mass.:
266.2946
SMILES:
COc1cccc(c1)-c1nc(OC)c2ccccc2n1
: