Target
Nuclear receptor subfamily 1 group I member 3
Ligand
BDBM50185306
Substrate
Meas. Tech.
ChEMBL_1587671 (CHEMBL3825785)
EC50
690±n/a nM
Citation
 Smutny, TNova, ADrechslerová, MCarazo, AHyrsova, LHru?ková, ZRKune?, JPour, M?pulák, MPavek, P 2-(3-Methoxyphenyl)quinazoline Derivatives: A New Class of Direct Constitutive Androstane Receptor (CAR) Agonists. J Med Chem 59:4601-10 (2016)  
Target
Name:
Nuclear receptor subfamily 1 group I member 3
Synonyms:
CAR NR1I3_HUMAN
Type:
PROTEIN
Mol. Mass.:
39953.17
Organism:
Homo sapiens (Human)
Description:
ChEMBL_1434936
Residue:
352
  
Inhibitor
Name:
BDBM50185306
Synonyms:
CHEMBL3823873
Type:
Small organic molecule
Emp. Form.:
C15H12N2OS
Mol. Mass.:
268.334
SMILES:
COc1cccc(c1)-c1nc2ccccc2c(=S)[nH]1
: