Target
Adenosine receptor A1
Ligand
BDBM50187675
Substrate
Meas. Tech.
ChEMBL_1590501 (CHEMBL3830977)
Ki
>1000±n/a nM
Citation
 Szymanska, EDrabczynska, AKarcz, TMüller, CEKöse, MKarolak-Wojciechowska, JFruzinski, ASchabikowski, JDoroz-Plonka, AHandzlik, JKiec-Kononowicz, K Similarities and differences in affinity and binding modes of tricyclic pyrimido- and pyrazinoxanthines at human and rat adenosine receptors. Bioorg Med Chem 24:4347-4362 (2016)  
Target
Name:
Adenosine receptor A1
Synonyms:
AA1R_RAT ADENOSINE A1 high Adenosine A1 receptor (A1) Adenosine receptors A1 | Adora1
Type:
Protein
Mol. Mass.:
36704.13
Organism:
Rattus norvegicus (rat)
Description:
Residue:
326
  
Inhibitor
Name:
BDBM50187675
Synonyms:
CHEMBL3827127
Type:
Small organic molecule
Emp. Form.:
C23H30N6O3
Mol. Mass.:
438.5227
SMILES:
Cn1c2nc3N(CCCn3c2c(=O)n(C)c1=O)c1ccc(OCCN2CCCCC2)cc1
: