Target
Cholinesterase
Ligand
BDBM50189326
Substrate
Meas. Tech.
ChEMBL_1589178 (CHEMBL3829833)
IC50
1230±n/a nM
Citation
 Montanari, SScalvini, LBartolini, MBelluti, FGobbi, SAndrisano, VLigresti, ADi Marzo, VRivara, SMor, MBisi, ARampa, A Fatty Acid Amide Hydrolase (FAAH), Acetylcholinesterase (AChE), and Butyrylcholinesterase (BuChE): Networked Targets for the Development of Carbamates as Potential Anti-Alzheimer's Disease Agents. J Med Chem 59:6387-406 (2016)  
Target
Name:
Cholinesterase
Synonyms:
Acylcholine acylhydrolase Butyrylcholine esterase (BChE) Butyrylcholinesterase (BuChE) CHLE_HUMAN Cholinesterases Pseudocholinesterase
Type:
Homotetramer
Mol. Mass.:
68422.27
Organism:
Homo sapiens (Human)
Description:
P06276
Residue:
602
  
Inhibitor
Name:
BDBM50189326
Synonyms:
CHEMBL3827950
Type:
Small organic molecule
Emp. Form.:
C30H28N4O5
Mol. Mass.:
524.5671
SMILES:
O=C(NCCCCCc1ccccc1)Oc1ccc(cc1)-n1cc(COc2ccc3ccc(=O)oc3c2)nn1
: