Target
Fatty-acid amide hydrolase 1 [30-579]
Ligand
BDBM50189326
Substrate
Meas. Tech.
ChEMBL_1589176 (CHEMBL3829831)
IC50
43±n/a nM
Citation
 Montanari, SScalvini, LBartolini, MBelluti, FGobbi, SAndrisano, VLigresti, ADi Marzo, VRivara, SMor, MBisi, ARampa, A Fatty Acid Amide Hydrolase (FAAH), Acetylcholinesterase (AChE), and Butyrylcholinesterase (BuChE): Networked Targets for the Development of Carbamates as Potential Anti-Alzheimer's Disease Agents. J Med Chem 59:6387-406 (2016)  
Target
Name:
Fatty-acid amide hydrolase 1 [30-579]
Synonyms:
Anandamide amidohydrolase 1 Faah Fatty Acid Amide Hydrolase Fatty-acid amide hydrolase (FAAH) Fatty-acid amide hydrolase 1 (FAAH) Oleamide hydrolase 1
Type:
Single-pass membrane protein; homodimer
Mol. Mass.:
60474.00
Organism:
Rattus norvegicus (rat)
Description:
P97612 (aa 30-579)
Residue:
550
  
Inhibitor
Name:
BDBM50189326
Synonyms:
CHEMBL3827950
Type:
Small organic molecule
Emp. Form.:
C30H28N4O5
Mol. Mass.:
524.5671
SMILES:
O=C(NCCCCCc1ccccc1)Oc1ccc(cc1)-n1cc(COc2ccc3ccc(=O)oc3c2)nn1
: