Target
Botulinum neurotoxin type E
Ligand
BDBM50189880
Substrate
Meas. Tech.
ChEMBL_1590439 (CHEMBL3830809)
IC50
2700±n/a nM
Citation
 Kumar, GAgarwal, RSwaminathan, S Small molecule non-peptide inhibitors of botulinum neurotoxin serotype E: Structure-activity relationship and a pharmacophore model. Bioorg Med Chem 24:3978-3985 (2016)  
Target
Name:
Botulinum neurotoxin type E
Synonyms:
BXE_CLOBO Bontoxilysin-E Botulinum neurotoxin E light chain botE
Type:
PROTEIN
Mol. Mass.:
143842.39
Organism:
Clostridium botulinum
Description:
ChEMBL_103941
Residue:
1251
  
Inhibitor
Name:
BDBM50189880
Synonyms:
CHEMBL3828454
Type:
Small organic molecule
Emp. Form.:
C27H17N3O7
Mol. Mass.:
495.4398
SMILES:
OC(=O)c1cc(ccc1-c1ccc(cc1C(=O)Nc1ccc-2c(Cc3ccccc-23)c1)[N+]([O-])=O)[N+]([O-])=O
: