Target
Cytochrome P450 3A4
Ligand
BDBM50189899
Substrate
Meas. Tech.
ChEMBL_1590964 (CHEMBL3830722)
IC50
>33000±n/a nM
Citation
 Loughran, HMHan, ZWrobel, JEDecker, SERuthel, GFreedman, BDHarty, RNReitz, AB Quinoxaline-based inhibitors of Ebola and Marburg VP40 egress. Bioorg Med Chem Lett 26:3429-35 (2016)  
Target
Name:
Cytochrome P450 3A4
Synonyms:
Albendazole monooxygenase CP3A4_HUMAN CYP3A4 CYPIIIA4 Cytochrome P450 3A4 (CYP3A4) Nifedipine oxidase Taurochenodeoxycholate 6-alpha-hydroxylase
Type:
Enzyme
Mol. Mass.:
57349.57
Organism:
Homo sapiens (Human)
Description:
Residue:
503
  
Inhibitor
Name:
BDBM50189899
Synonyms:
CHEMBL3828283
Type:
Small organic molecule
Emp. Form.:
C19H18N4O2S
Mol. Mass.:
366.437
SMILES:
Cc1ccc(NC(=O)NC(=O)CSc2nc3ccccc3nc2C)cc1
: